BDBM73332 MLS000052544::N-[5-keto-2-phenyl-4-(trifluoromethyl)-2-imidazolin-4-yl]carbamic acid ethyl ester::N-[5-oxo-2-phenyl-4-(trifluoromethyl)-1H-imidazol-4-yl]carbamic acid ethyl ester::SMR000082028::cid_2978721::ethyl N-[5-oxidanylidene-2-phenyl-4-(trifluoromethyl)-1H-imidazol-4-yl]carbamate::ethyl N-[5-oxo-2-phenyl-4-(trifluoromethyl)-1H-imidazol-4-yl]carbamate::ethyl [5-oxo-2-phenyl-4-(trifluoromethyl)-4,5-dihydro-1H-imidazol-4-yl]carbamate
SMILES CCOC(=O)NC1(N=C(NC1=O)c1ccccc1)C(F)(F)F
InChI Key InChIKey=UTBXQXDHJQPHJP-UHFFFAOYSA-N
Data  1 EC50
  Tab Delimited (TSV)   2D SDfile   Computed 3D by Vconf -m prep SDfile
Find this compound or compounds like it in BindingDB:
Activity Spreadsheet -- Enzyme Inhibition Constant Data from BindingDB
Found 1 hit for monomerid = 73332
TargetProtein LANA1(Human herpesvirus 8)
Broad Institute
Curated by PubChem BioAssay
LigandPNGBDBM73332(MLS000052544 | N-[5-keto-2-phenyl-4-(trifluorometh...)
Affinity DataEC50: >7.50E+4nM. Assay description: Primary Collaborators: Kenneth Kaye,Brigham & Womens,Boston MA,kkaye@rics.bwh.harvard.edu,617-525-4256 Chantal Beauchemin,Brigham & Womens,Boston MA,...
In DepthDetails PCBioAssay