BDBM73508 MLS000334229::N-benzyl-N-methyl-2-(6-methyl-2-nitropyridin-3-yl)oxyacetamide::N-benzyl-N-methyl-2-[(6-methyl-2-nitro-3-pyridyl)oxy]acetamide::N-methyl-2-(6-methyl-2-nitro-pyridin-3-yl)oxy-N-(phenylmethyl)ethanamide::N-methyl-2-[(6-methyl-2-nitro-3-pyridinyl)oxy]-N-(phenylmethyl)acetamide::SMR000248987::cid_4818072
SMILES CN(Cc1ccccc1)C(=O)COc1ccc(C)nc1[N+]([O-])=O
InChI Key InChIKey=CAJXFTVZTOQSMR-UHFFFAOYSA-N
Data  1 EC50
  Tab Delimited (TSV)   2D SDfile   Computed 3D by Vconf -m prep SDfile
Find this compound or compounds like it in BindingDB:
Activity Spreadsheet -- Enzyme Inhibition Constant Data from BindingDB
Found 1 hit for monomerid = 73508
TargetProtein LANA1(Human herpesvirus 8)
Broad Institute
Curated by PubChem BioAssay
LigandPNGBDBM73508(MLS000334229 | N-benzyl-N-methyl-2-(6-methyl-2-nit...)
Affinity DataEC50: >7.50E+4nM. Assay description: Primary Collaborators: Kenneth Kaye,Brigham & Womens,Boston MA,kkaye@rics.bwh.harvard.edu,617-525-4256 Chantal Beauchemin,Brigham & Womens,Boston MA,...
In DepthDetails PCBioAssay