BDBM73771 MLS000737609::N-[(1-hydroxy-3-methyl-cyclohexyl)methyl]acetamide::N-[(1-hydroxy-3-methylcyclohexyl)methyl]acetamide::N-[(3-methyl-1-oxidanyl-cyclohexyl)methyl]ethanamide::SMR000393780::cid_232439
SMILES CC1CCCC(O)(CNC(C)=O)C1
InChI Key InChIKey=YHDKZEYGKLYRSE-UHFFFAOYSA-N
Data  1 EC50
  Tab Delimited (TSV)   2D SDfile   Computed 3D by Vconf -m prep SDfile
Find this compound or compounds like it in BindingDB:
Activity Spreadsheet -- Enzyme Inhibition Constant Data from BindingDB
Found 1 hit for monomerid = 73771
TargetProtein LANA1(Human herpesvirus 8)
Broad Institute
Curated by PubChem BioAssay
LigandPNGBDBM73771(MLS000737609 | N-[(1-hydroxy-3-methyl-cyclohexyl)m...)
Affinity DataEC50: >7.50E+4nM. Assay description: Primary Collaborators: Kenneth Kaye,Brigham & Womens,Boston MA,kkaye@rics.bwh.harvard.edu,617-525-4256 Chantal Beauchemin,Brigham & Womens,Boston MA,...
Ligand InfoPC cidPC sid
In DepthDetails PCBioAssay