BDBM73831 6-(benzylthio)nicotinic acid methyl ester::6-(phenylmethylthio)-3-pyridinecarboxylic acid methyl ester::MLS001179340::SMR000476531::cid_902001::methyl 6-(benzylsulfanyl)nicotinate::methyl 6-(phenylmethylsulfanyl)pyridine-3-carboxylate::methyl 6-benzylsulfanylpyridine-3-carboxylate
SMILES COC(=O)c1ccc(SCc2ccccc2)nc1
InChI Key InChIKey=KHHLURLWLDYWDX-UHFFFAOYSA-N
Data  1 EC50
  Tab Delimited (TSV)   2D SDfile   Computed 3D by Vconf -m prep SDfile
Find this compound or compounds like it in BindingDB:
Activity Spreadsheet -- Enzyme Inhibition Constant Data from BindingDB
Found 1 hit for monomerid = 73831
TargetProtein LANA1(Human herpesvirus 8)
Broad Institute
Curated by PubChem BioAssay
LigandPNGBDBM73831(6-(benzylthio)nicotinic acid methyl ester | 6-(phe...)
Affinity DataEC50: >7.50E+4nM. Assay description: Primary Collaborators: Kenneth Kaye,Brigham & Womens,Boston MA,kkaye@rics.bwh.harvard.edu,617-525-4256 Chantal Beauchemin,Brigham & Womens,Boston MA,...
In DepthDetails PCBioAssay