BDBM74190 MLS001234850::N-(1,1-diketo-3-methyl-thiolan-3-yl)-N-methyl-piperonylamide::N-methyl-N-(3-methyl-1,1-dioxo-3-thiolanyl)-1,3-benzodioxole-5-carboxamide::N-methyl-N-(3-methyl-1,1-dioxothiolan-3-yl)-1,3-benzodioxole-5-carboxamide::N-methyl-N-[3-methyl-1,1-bis(oxidanylidene)thiolan-3-yl]-1,3-benzodioxole-5-carboxamide::SMR000811071::cid_16265622
SMILES CN(C(=O)c1ccc2OCOc2c1)C1(C)CCS(=O)(=O)C1
InChI Key InChIKey=XNOWGVCTROVGOD-UHFFFAOYSA-N
Data  1 EC50
  Tab Delimited (TSV)   2D SDfile   Computed 3D by Vconf -m prep SDfile
Find this compound or compounds like it in BindingDB:
Activity Spreadsheet -- Enzyme Inhibition Constant Data from BindingDB
Found 1 hit for monomerid = 74190
TargetProtein LANA1(Human herpesvirus 8)
Broad Institute
Curated by PubChem BioAssay
LigandPNGBDBM74190(MLS001234850 | N-(1,1-diketo-3-methyl-thiolan-3-yl...)
Affinity DataEC50: >7.50E+4nM. Assay description: Primary Collaborators: Kenneth Kaye,Brigham & Womens,Boston MA,kkaye@rics.bwh.harvard.edu,617-525-4256 Chantal Beauchemin,Brigham & Womens,Boston MA,...
In DepthDetails PCBioAssay