BDBM74503 4-[(4-bromo-1-ethyl-pyrazole-3-carbonyl)thiocarbamoylamino]benzoic acid methyl ester::4-[[[[(4-bromo-1-ethyl-3-pyrazolyl)-oxomethyl]amino]-sulfanylidenemethyl]amino]benzoic acid methyl ester::MLS000700620::SMR000227880::cid_994540::methyl 4-[(4-bromanyl-1-ethyl-pyrazol-3-yl)carbonylcarbamothioylamino]benzoate::methyl 4-[(4-bromo-1-ethylpyrazole-3-carbonyl)carbamothioylamino]benzoate::methyl 4-[({[(4-bromo-1-ethyl-1H-pyrazol-3-yl)carbonyl]amino}carbothioyl)amino]benzoate
SMILES CCn1cc(Br)c(n1)C(=O)NC(=S)Nc1ccc(cc1)C(=O)OC
InChI Key InChIKey=ZFJAXQZXOUWQPC-UHFFFAOYSA-N
Data  3 IC50
  Tab Delimited (TSV)   2D SDfile   Computed 3D by Vconf -m prep SDfile
Find this compound or compounds like it in BindingDB:
Activity Spreadsheet -- Enzyme Inhibition Constant Data from BindingDB
Found 3 hits for monomerid = 74503
TargetTyrosine-protein phosphatase non-receptor type 22(Homo sapiens (Human))
Burnham Center For Chemical Genomics
Curated by PubChem BioAssay
LigandPNGBDBM74503(4-[(4-bromo-1-ethyl-pyrazole-3-carbonyl)thiocarbam...)
Affinity DataIC50: >7.94E+4nM. Assay description: Data Source: Sanford-Burnham Center for Chemical Genomics (SBCCG) Source Affiliation: Sanford-Burnham Medical Research Institute (SBMRI, San Diego, ...
In DepthDetails PCBioAssay
TargetTyrosine-protein phosphatase non-receptor type 22(Homo sapiens (Human))
Burnham Center For Chemical Genomics
Curated by PubChem BioAssay
LigandPNGBDBM74503(4-[(4-bromo-1-ethyl-pyrazole-3-carbonyl)thiocarbam...)
Affinity DataIC50: >7.94E+4nM. Assay description: Data Source: Sanford-Burnham Center for Chemical Genomics (SBCCG) Source Affiliation: Sanford-Burnham Medical Research Institute (SBMRI, San Diego, ...
In DepthDetails PCBioAssay
TargetTyrosine-protein phosphatase non-receptor type 7(Homo sapiens (Human))
Burnham Center For Chemical Genomics
Curated by PubChem BioAssay
LigandPNGBDBM74503(4-[(4-bromo-1-ethyl-pyrazole-3-carbonyl)thiocarbam...)
Affinity DataIC50: >7.94E+4nM. Assay description: Data Source: Sanford-Burnham Center for Chemical Genomics (SBCCG) Source Affiliation: Sanford-Burnham Medical Research Institute (SBMRI, San Diego, C...
In DepthDetails PCBioAssay