BDBM74772 (5,6-dimethyl-4-oxidanylidene-3H-thieno[2,3-d]pyrimidin-2-yl)methyl 2-phenylethanoate::(5,6-dimethyl-4-oxo-3H-thieno[2,3-d]pyrimidin-2-yl)methyl 2-phenylacetate::2-phenylacetic acid (4-keto-5,6-dimethyl-3H-thieno[2,3-d]pyrimidin-2-yl)methyl ester::2-phenylacetic acid (5,6-dimethyl-4-oxo-3H-thieno[2,3-d]pyrimidin-2-yl)methyl ester::MLS000564157::SMR000151671::cid_2386516
SMILES Cc1sc2nc(COC(=O)Cc3ccccc3)[nH]c(=O)c2c1C
InChI Key InChIKey=YUCPVWMQOQDABW-UHFFFAOYSA-N
Data  1 EC50
  Tab Delimited (TSV)   2D SDfile   Computed 3D by Vconf -m prep SDfile
Find this compound or compounds like it in BindingDB:
Activity Spreadsheet -- Enzyme Inhibition Constant Data from BindingDB
Found 1 hit for monomerid = 74772
TargetImportin subunit alpha-1(Homo sapiens (Human))
Broad Institute
Curated by PubChem BioAssay
LigandPNGBDBM74772((5,6-dimethyl-4-oxidanylidene-3H-thieno[2,3-d]pyri...)
Affinity DataEC50: >5.00E+5nM. Assay description: Keywords: Counterscreen, FRET assay, HTS, YIC probe, Dose response, Assay Overview: This is a fluorescence resonance energy transfer (FRET)-based b...
Ligand InfoPC cidPC sid
In DepthDetails PCBioAssay