BDBM75868 1-(4-chlorophenyl)-5-[(E)-(thiocarbamoylhydrazono)methyl]pyrazole-4-carboxylic acid methyl ester::5-[(E)-(carbamothioylhydrazinylidene)methyl]-1-(4-chlorophenyl)-4-pyrazolecarboxylic acid methyl ester::MLS-0297592.0001::cid_9581014::methyl 5-[(E)-(carbamothioylhydrazinylidene)methyl]-1-(4-chlorophenyl)pyrazole-4-carboxylate
SMILES COC(=O)c1cnn(c1C=NNC(N)=S)-c1ccc(Cl)cc1
InChI Key InChIKey=HHYLDEGKQSHYNO-UHFFFAOYSA-N
Data  2 IC50
  Tab Delimited (TSV)   2D SDfile   Computed 3D by Vconf -m prep SDfile
Find this compound or compounds like it in BindingDB:
Activity Spreadsheet -- Enzyme Inhibition Constant Data from BindingDB
Found 2 hits for monomerid = 75868
TargetG-protein coupled receptor 55(Homo sapiens (Human))
Burnham Center For Chemical Genomics
Curated by PubChem BioAssay
LigandPNGBDBM75868(1-(4-chlorophenyl)-5-[(E)-(thiocarbamoylhydrazono)...)
Affinity DataIC50: >3.20E+4nM. Assay description: Data Source: Sanford-Burnham Center for Chemical Genomics(SBCCG) Source Affiliation: Sanford-Burnham Medical Research Institute (SBMRI, San Diego, C...
In DepthDetails PCBioAssay
TargetG-protein coupled receptor 35(Homo sapiens (Human))
Burnham Center For Chemical Genomics
Curated by PubChem BioAssay
LigandPNGBDBM75868(1-(4-chlorophenyl)-5-[(E)-(thiocarbamoylhydrazono)...)
Affinity DataIC50:  4.60E+3nM. Assay description: Data Source: Sanford-Burnham Center for Chemical Genomics Source Affiliation: Sanford-Burnham Medical Research Institute (SBMRI, San Diego, CA) Netw...
In DepthDetails PCBioAssay