BDBM76229 MLS001224222::SMR000678823::[4-[[(3,5-dihydroxybenzoyl)hydrazinylidene]methyl]-2-methoxyphenyl] benzoate::[4-[[[3,5-bis(oxidanyl)phenyl]carbonylhydrazinylidene]methyl]-2-methoxy-phenyl] benzoate::benzoic acid [4-[[(3,5-dihydroxybenzoyl)hydrazono]methyl]-2-methoxy-phenyl] ester::benzoic acid [4-[[[(3,5-dihydroxyphenyl)-oxomethyl]hydrazinylidene]methyl]-2-methoxyphenyl] ester::cid_24819721
SMILES COc1cc(C=NNC(=O)c2cc(O)cc(O)c2)ccc1OC(=O)c1ccccc1
InChI Key InChIKey=IBAJQZZCCHZACD-UHFFFAOYSA-N
Data  4 IC50
  Tab Delimited (TSV)   2D SDfile   Computed 3D by Vconf -m prep SDfile
Find this compound or compounds like it in BindingDB:
Activity Spreadsheet -- Enzyme Inhibition Constant Data from BindingDB
Found 4 hits for monomerid = 76229
TargetIntestinal-type alkaline phosphatase(Homo sapiens (Human))
Burnham Center For Chemical Genomics
Curated by PubChem BioAssay
LigandPNGBDBM76229(MLS001224222 | SMR000678823 | [4-[[(3,5-dihydroxyb...)
Affinity DataIC50:  7.71E+4nM. Assay description: Data Source: Sanford-Burnham Center for Chemical Genomics (SBCCG) Source Affiliation: Sanford-Burnham Medical Research Institute(SBMRI, San Diego, CA...
In DepthDetails PCBioAssay
TargetIntestinal-type alkaline phosphatase 1(Rattus norvegicus (Rat))
Burnham Center For Chemical Genomics
Curated by PubChem BioAssay
LigandPNGBDBM76229(MLS001224222 | SMR000678823 | [4-[[(3,5-dihydroxyb...)
Affinity DataIC50:  4.43E+3nM. Assay description: Data Source: Sanford-Burnham Center for Chemical Genomics (SBCCG) Source Affiliation: Sanford-Burnham Medical Research Institute (SBMRI, San Diego, C...
In DepthDetails PCBioAssay
TargetAlkaline phosphatase, tissue-nonspecific isozyme(Homo sapiens (Human))
Burnham Center For Chemical Genomics
Curated by PubChem BioAssay
LigandPNGBDBM76229(MLS001224222 | SMR000678823 | [4-[[(3,5-dihydroxyb...)
Affinity DataIC50:  2.68E+4nM. Assay description: Data Source: Sanford-Burnham Center for Chemical Genomics (SBCCG) Source Affiliation: Sanford-Burnham Medical Research Institute (SBMRI, San Diego, C...
In DepthDetails PCBioAssay
TargetAlkaline phosphatase, germ cell type(Homo sapiens (Human))
Burnham Center For Chemical Genomics
Curated by PubChem BioAssay
LigandPNGBDBM76229(MLS001224222 | SMR000678823 | [4-[[(3,5-dihydroxyb...)
Affinity DataIC50:  7.01E+4nM. Assay description: Data Source: Sanford-Burnham Center for Chemical Genomics (SBCCG) Source Affiliation: Sanford-Burnham Medical Research Institute (SBMRI, San Diego, C...
In DepthDetails PCBioAssay