BDBM76445 2-[[(E)-3-keto-3-phenyl-prop-1-enyl]amino]benzoic acid ethyl ester::2-[[(E)-3-oxo-3-phenylprop-1-enyl]amino]benzoic acid ethyl ester::MLS000575286::SMR000196520::cid_2291143::ethyl 2-[(3-oxo-3-phenyl-1-propen-1-yl)amino]benzoate::ethyl 2-[[(E)-3-oxidanylidene-3-phenyl-prop-1-enyl]amino]benzoate::ethyl 2-[[(E)-3-oxo-3-phenylprop-1-enyl]amino]benzoate
SMILES CCOC(=O)c1ccccc1N=CCC(=O)c1ccccc1
InChI Key InChIKey=WIZDICIBTLKOBC-UHFFFAOYSA-N
Data  3 IC50
  Tab Delimited (TSV)   2D SDfile   Computed 3D by Vconf -m prep SDfile
Find this compound or compounds like it in BindingDB:
Activity Spreadsheet -- Enzyme Inhibition Constant Data from BindingDB
Found 3 hits for monomerid = 76445
TargetSentrin-specific protease 8(Homo sapiens (Human))
Burnham Center For Chemical Genomics
Curated by PubChem BioAssay
LigandPNGBDBM76445(2-[[(E)-3-keto-3-phenyl-prop-1-enyl]amino]benzoic ...)
Affinity DataIC50:  1.87E+4nM. Assay description: Data Source: Sanford-Burnham Center for Chemical Genomics (SBCCG) Source Affiliation: Sanford-Burnham Medical Research Institute (SBMRI, San Diego, C...
Ligand InfoPC cidPC sid
In DepthDetails PCBioAssay
TargetCaspase-3(Homo sapiens (Human))
Burnham Center For Chemical Genomics
Curated by PubChem BioAssay
LigandPNGBDBM76445(2-[[(E)-3-keto-3-phenyl-prop-1-enyl]amino]benzoic ...)
Affinity DataIC50:  3.31E+4nM. Assay description: Data Source: Sanford-Burnham Center for Chemical Genomics (SBCCG) Source Affiliation: Sanford-Burnham Medical Research Institute (SBMRI, San Diego, C...
Ligand InfoPC cidPC sid
In DepthDetails PCBioAssay
TargetSentrin-specific protease 6(Homo sapiens (Human))
Burnham Center For Chemical Genomics
Curated by PubChem BioAssay
LigandPNGBDBM76445(2-[[(E)-3-keto-3-phenyl-prop-1-enyl]amino]benzoic ...)
Affinity DataIC50:  1.62E+4nM. Assay description: Data Source: Sanford-Burnham Center for Chemical Genomics (SBCCG) Source Affiliation: Sanford-Burnham Medical Research Institute (SBMRI, San Diego, C...
Ligand InfoPC cidPC sid
In DepthDetails PCBioAssay