BDBM76557 4-phenylazobenzoic acid methyl ester::4-phenyldiazenylbenzoic acid methyl ester::MLS001005712::SMR000348913::cid_273419::methyl 4-phenyldiazenylbenzoate
SMILES COC(=O)c1ccc(cc1)\N=N\c1ccccc1
InChI Key InChIKey=SUFXZYCPKGRJIZ-FOCLMDBBSA-N
Data  3 IC50
  Tab Delimited (TSV)   2D SDfile   Computed 3D by Vconf -m prep SDfile
Find this compound or compounds like it in BindingDB:
Activity Spreadsheet -- Enzyme Inhibition Constant Data from BindingDB
Found 3 hits for monomerid = 76557
TargetCaspase-3(Homo sapiens (Human))
Burnham Center For Chemical Genomics
Curated by PubChem BioAssay
LigandPNGBDBM76557(4-phenylazobenzoic acid methyl ester | 4-phenyldia...)
Affinity DataIC50:  1.16E+4nM. Assay description: Data Source: Sanford-Burnham Center for Chemical Genomics (SBCCG) Source Affiliation: Sanford-Burnham Medical Research Institute (SBMRI, San Diego, C...
In DepthDetails PCBioAssay
TargetSentrin-specific protease 6(Homo sapiens (Human))
Burnham Center For Chemical Genomics
Curated by PubChem BioAssay
LigandPNGBDBM76557(4-phenylazobenzoic acid methyl ester | 4-phenyldia...)
Affinity DataIC50:  1.32E+4nM. Assay description: Data Source: Sanford-Burnham Center for Chemical Genomics (SBCCG) Source Affiliation: Sanford-Burnham Medical Research Institute (SBMRI, San Diego, C...
In DepthDetails PCBioAssay
TargetSentrin-specific protease 8(Homo sapiens (Human))
Burnham Center For Chemical Genomics
Curated by PubChem BioAssay
LigandPNGBDBM76557(4-phenylazobenzoic acid methyl ester | 4-phenyldia...)
Affinity DataIC50:  2.02E+4nM. Assay description: Data Source: Sanford-Burnham Center for Chemical Genomics (SBCCG) Source Affiliation: Sanford-Burnham Medical Research Institute (SBMRI, San Diego, C...
In DepthDetails PCBioAssay