BDBM81304 Azole, 9
SMILES COc1cccc(Sc2ccc(cc2)C(=O)NCC(c2ccccc2)n2ccnc2)c1
InChI Key InChIKey=QSNMIVWHYBMXTM-UHFFFAOYSA-N
Data  2 Kd
  Tab Delimited (TSV)   2D SDfile   Computed 3D by Vconf -m prep SDfile
Find this compound or compounds like it in BindingDB:
Activity Spreadsheet -- Enzyme Inhibition Constant Data from BindingDB
Found 2 hits for monomerid = 81304
TargetLanosterol 14-alpha-demethylase(Trypanosoma brucei)
Vanderbilt University
LigandPNGBDBM81304(Azole, 9)
Affinity DataKd:  70nMpH: 6.0Assay Description:Azole derivatives used as an inhibitor of TB and TC CYP51.
Ligand InfoPC cidPC sid
In DepthDetails ArticlePubMed
TargetSterol 14-alpha demethylase(Trypanosoma cruzi)
Vanderbilt University
LigandPNGBDBM81304(Azole, 9)
Affinity DataKd:  90nMpH: 6.0Assay Description:Azole derivatives used as an inhibitor of TB and TC CYP51.
Ligand InfoPC cidPC sid
In DepthDetails ArticlePubMed