BDBM82063 CAS_78-30-8::TCP::TRI-O-CRESYL PHOSPHATE
SMILES Cc1ccccc1OP(=O)(Oc1ccccc1C)Oc1ccccc1C
InChI Key InChIKey=YSMRWXYRXBRSND-UHFFFAOYSA-N
Data  5 KI
  Tab Delimited (TSV)   2D SDfile   Computed 3D by Vconf -m prep SDfile
Find this compound or compounds like it in BindingDB:
Activity Spreadsheet -- Enzyme Inhibition Constant Data from BindingDB
Found 5 hits for monomerid = 82063
TargetGlutamate receptor ionotropic, NMDA 1(RAT)
The Johns Hopkins University
Curated by PDSP Ki Database
LigandPNGBDBM82063(CAS_78-30-8 | TCP | TRI-O-CRESYL PHOSPHATE)
Affinity DataKi:  11nM
In DepthDetails PubMed
TargetGlutamate receptor ionotropic, NMDA 1(RAT)
The Johns Hopkins University
Curated by PDSP Ki Database
LigandPNGBDBM82063(CAS_78-30-8 | TCP | TRI-O-CRESYL PHOSPHATE)
Affinity DataKi:  19nM
In DepthDetails PubMed
TargetGlutamate receptor ionotropic, NMDA 1(RAT)
The Johns Hopkins University
Curated by PDSP Ki Database
LigandPNGBDBM82063(CAS_78-30-8 | TCP | TRI-O-CRESYL PHOSPHATE)
Affinity DataKi:  265nM
In DepthDetails PubMed
TargetGlutamate receptor ionotropic, NMDA 1(RAT)
The Johns Hopkins University
Curated by PDSP Ki Database
LigandPNGBDBM82063(CAS_78-30-8 | TCP | TRI-O-CRESYL PHOSPHATE)
Affinity DataKi:  3.72E+3nM
In DepthDetails PubMed
TargetGlutamate receptor ionotropic, NMDA 1(RAT)
The Johns Hopkins University
Curated by PDSP Ki Database
LigandPNGBDBM82063(CAS_78-30-8 | TCP | TRI-O-CRESYL PHOSPHATE)
Affinity DataKi:  6.20E+3nM
In DepthDetails PubMed