BDBM82187 Salicylic acid derivative, 76D10
SMILES OC(=O)c1cc(ccc1O)-c1ccc(\C=C\C(=O)\C=C\c2ccc(o2)-c2ccc(O)c(c2)C(O)=O)o1
InChI Key InChIKey=SJZMHYWRMFTKSW-GGWOSOGESA-N
Data  1 IC50
  Tab Delimited (TSV)   2D SDfile   Computed 3D by Vconf -m prep SDfile
Find this compound or compounds like it in BindingDB:
Activity Spreadsheet -- Enzyme Inhibition Constant Data from BindingDB
Found 1 hit for monomerid = 82187
TargetEphrin type-A receptor 4 [1-949,A922V](Homo sapiens (Human))
Sanford-Burnham Medical Research Institute
LigandPNGBDBM82187(Salicylic acid derivative, 76D10)
Affinity DataIC50:  2.60E+3nMpH: 7.5Assay Description:Protein A-coasted wells (from Pierce Biotechnology) were used to immobilize Eph receptor Fc fusion proteins (from R&D systems)incubated at 1 ug/ml in...
In DepthDetails ArticlePubMed