BDBM82232 CAS_8977::GDP::NSC_8977
SMILES Nc1nc2n(cnc2c(=O)[nH]1)C1OC(COP(O)(=O)OP(O)(O)=O)C(O)C1O
InChI Key InChIKey=QGWNDRXFNXRZMB-UHFFFAOYSA-N
Data  2 KI
PDB links: 1967 PDB IDs match this monomer.
  Tab Delimited (TSV)   2D SDfile   Computed 3D by Vconf -m prep SDfile
Find this compound or compounds like it in BindingDB:
Activity Spreadsheet -- Enzyme Inhibition Constant Data from BindingDB
Found 2 hits for monomerid = 82232
TargetCholecystokinin(RAT)
F. Hoffmann-La Roche
Curated by PDSP Ki Database
LigandPNGBDBM82232(CAS_8977 | GDP | NSC_8977)
Affinity DataKi:  0.5nM
In DepthDetails PubMed
TargetCholecystokinin(RAT)
F. Hoffmann-La Roche
Curated by PDSP Ki Database
LigandPNGBDBM82232(CAS_8977 | GDP | NSC_8977)
Affinity DataKi:  1.00E+3nM
In DepthDetails PubMed