BDBM82694 4-phenyl-N'-(phenylcarbonyl)benzohydrazide::MLS000595021::N'-benzoyl-4-biphenylcarbohydrazide::N'-benzoyl-4-phenyl-benzohydrazide::N'-benzoyl-4-phenylbenzohydrazide::SMR000184408::cid_683837
SMILES O=C(NNC(=O)c1ccc(cc1)-c1ccccc1)c1ccccc1
InChI Key InChIKey=IPWKDRARRODXMU-UHFFFAOYSA-N
Data  1 IC50
  Tab Delimited (TSV)   2D SDfile   Computed 3D by Vconf -m prep SDfile
Find this compound or compounds like it in BindingDB:
Activity Spreadsheet -- Enzyme Inhibition Constant Data from BindingDB
Found 1 hit for monomerid = 82694
TargetCarboxy-terminal domain RNA polymerase II polypeptide A small phosphatase 1(Homo sapiens (Human))
Burnham Center For Chemical Genomics
Curated by PubChem BioAssay
LigandPNGBDBM82694(4-phenyl-N'-(phenylcarbonyl)benzohydrazide | MLS00...)
Affinity DataIC50:  1.12E+4nM. Assay description: Data Source: Sanford-Burnham Center for Chemical Genomics (SBCCG) Source Affiliation: Sanford-Burnham Medical Research Institute (SBMRI, San Diego, C...
In DepthDetails PCBioAssay