BDBM82872 4-(2-furanylmethylsulfamoyl)benzoic acid [2-(dimethylamino)-2-oxoethyl] ester::4-(2-furfurylsulfamoyl)benzoic acid [2-(dimethylamino)-2-keto-ethyl] ester::MLS000773363::SMR000364062::[2-(dimethylamino)-2-oxidanylidene-ethyl] 4-(furan-2-ylmethylsulfamoyl)benzoate::[2-(dimethylamino)-2-oxoethyl] 4-(furan-2-ylmethylsulfamoyl)benzoate::cid_2448843
SMILES CN(C)C(=O)COC(=O)c1ccc(cc1)S(=O)(=O)NCc1ccco1
InChI Key InChIKey=JZDRPILUUPXMRF-UHFFFAOYSA-N
Data  1 IC50
  Tab Delimited (TSV)   2D SDfile   Computed 3D by Vconf -m prep SDfile
Find this compound or compounds like it in BindingDB:
Activity Spreadsheet -- Enzyme Inhibition Constant Data from BindingDB
Found 1 hit for monomerid = 82872
TargetCarboxy-terminal domain RNA polymerase II polypeptide A small phosphatase 1(Homo sapiens (Human))
Burnham Center For Chemical Genomics
Curated by PubChem BioAssay
LigandPNGBDBM82872(4-(2-furanylmethylsulfamoyl)benzoic acid [2-(dimet...)
Affinity DataIC50:  6.65E+3nM. Assay description: Data Source: Sanford-Burnham Center for Chemical Genomics (SBCCG) Source Affiliation: Sanford-Burnham Medical Research Institute (SBMRI, San Diego, C...
In DepthDetails PCBioAssay