BDBM8327 4-(dimethylamino)-N-{5-phenyl-1H-pyrazolo[3,4-c]pyridazin-3-yl}butanamide::pyrazolopyridazine deriv. 9
SMILES CN(C)CCCC(=O)Nc1n[nH]c2nnc(cc12)-c1ccccc1
InChI Key InChIKey=LDHIZDYQCCLGRS-UHFFFAOYSA-N
Data  1 KI  2 IC50
  Tab Delimited (TSV)   2D SDfile   Computed 3D by Vconf -m prep SDfile
Find this compound or compounds like it in BindingDB:
Activity Spreadsheet -- Enzyme Inhibition Constant Data from BindingDB
Found 3 hits for monomerid = 8327
TargetCyclin-A2/Cyclin-dependent kinase 2(Homo sapiens (Human))
Glaxosmithkline
LigandPNGBDBM8327(4-(dimethylamino)-N-{5-phenyl-1H-pyrazolo[3,4-c]py...)
Affinity DataKi:  1.70E+3nM ΔG°:  -7.76kcal/molepH: 7.5 T: 2°C. Assay description: In vitro kinase assay using purified CDK2/Cyclin A was incubated at room temperature with substrate, and test compounds in the presence of 100 uM ATP...
In DepthDetails ArticlePubMed
TargetGlycogen synthase kinase-3 beta(Homo sapiens (Human))
University Of Jordan
Curated by ChEMBL
LigandPNGBDBM8327(4-(dimethylamino)-N-{5-phenyl-1H-pyrazolo[3,4-c]py...)
Affinity DataIC50:  22nM. Assay description: Inhibition of recombinant GSK3-beta
In DepthDetails ArticlePubMed
TargetGlycogen synthase kinase-3 alpha(Homo sapiens (Human))
Glaxosmithkline
LigandPNGBDBM8327(4-(dimethylamino)-N-{5-phenyl-1H-pyrazolo[3,4-c]py...)
Affinity DataIC50:  22nM. Assay description: The biochemical activity of compounds was determined by incubation with specific enzyme and substrate in the presence 10 uM ATP/ [gamma-33P] ATP. Aft...
In DepthDetails ArticlePubMed