BDBM83448 Buprenorphine-3--Beta--D-glucuronide::MLS002320705::SMR001338851::cid_44246524
SMILES [H][C@]12Cc3ccc(OC4OC([C@@H](O)C(O)[C@H]4O)C(O)=O)c4OC5[C@](CCN1CC1CC1)(c34)C21CCC5(OC)C(C1)C(C)(O)C(C)(C)C
InChI Key InChIKey=CZULHKGIAJASAA-WJVLGYIRSA-N
Data  1 EC50
  Tab Delimited (TSV)   2D SDfile   Computed 3D by Vconf -m prep SDfile
Find this compound or compounds like it in BindingDB:
Activity Spreadsheet -- Enzyme Inhibition Constant Data from BindingDB
Found 1 hit for monomerid = 83448
TargetDelta-type opioid receptor(Homo sapiens (Human))
The Scripps Research Institute Molecular Screening Center
Curated by PubChem BioAssay
LigandPNGBDBM83448(Buprenorphine-3--Beta--D-glucuronide | MLS00232070...)
Affinity DataEC50: >9.25E+4nM. Assay description: Source (MLPCN Center Name): The Scripps Research Institute Molecular Screening Center (SRIMSC) Affiliation: The Scripps Research Institute, TSRI Assa...
In DepthDetails PCBioAssay