BDBM84513 Sulindac analogue, 10
SMILES CC1=C(CC(O)=O)c2cc(F)ccc2\C1=C/c1ccc(F)c(F)c1
InChI Key InChIKey=MZVTXMOFFQLWGZ-NSIKDUERSA-N
Data  1 IC50
  Tab Delimited (TSV)   2D SDfile   Computed 3D by Vconf -m prep SDfile
Find this compound or compounds like it in BindingDB:
Activity Spreadsheet -- Enzyme Inhibition Constant Data from BindingDB
Found 1 hit for monomerid = 84513
TargetAngiopoietin-1 receptor(Homo sapiens (Human))
Max-Planck-Institut FÜR Molekulare Physiologie
LigandPNGBDBM84513(Sulindac analogue, 10)
Affinity DataIC50:  5.00E+3nM. Assay description: The kinase-catalyzed phosphorylation of poly(Glu4-Tyr) in the presence of varying concentrations of inhibitor was determined. The kinase were employ...
In DepthDetails ArticlePubMed