BDBM84557 Phosphate analogue, 6
SMILES CCP(O)(O)=O
InChI Key InChIKey=GATNOFPXSDHULC-UHFFFAOYSA-N
Data  2 KI
  Tab Delimited (TSV)   2D SDfile   Computed 3D by Vconf -m prep SDfile
Find this compound or compounds like it in BindingDB:
Activity Spreadsheet -- Enzyme Inhibition Constant Data from BindingDB
Found 2 hits for monomerid = 84557
TargetFe(3+)-Zn(2+) purple acid phosphatase(Phaseolus vulgaris)
The University Of Queensland
Curated by ChEMBL
LigandPNGBDBM84557(Phosphate analogue, 6)
Affinity DataKi:  7.60E+6nM. Assay description: Inhibition of red kidney beans purple acid phosphatase
In DepthDetails ArticlePubMed
Target1-deoxy-D-xylulose 5-phosphate reductoisomerase(Escherichia coli)
University Of Bristol
LigandPNGBDBM84557(Phosphate analogue, 6)
Affinity DataKi:  1.80E+7nM ΔG°:  -2.47kcal/molepH: 8.0 T: 2°C. Assay description: The assay was monitored spectrophotometrically through the consumption of beta-NADPH. The inhibitor assays contained inhibitor at concentrations of ...
In DepthDetails ArticlePubMed