BDBM84615 Mannostatin analogue, 4a
SMILES N[C@@H]1[C@@H](O)[C@H](O)[C@H](O)[C@@H]1O
InChI Key InChIKey=LZCRRHQKPAEPKL-PTSYSAGVSA-N
Data  1 KI
PDB links: 1 PDB ID matches this monomer.
  Tab Delimited (TSV)   2D SDfile   Computed 3D by Vconf -m prep SDfile
Find this compound or compounds like it in BindingDB:
Activity Spreadsheet -- Enzyme Inhibition Constant Data from BindingDB
Found 1 hit for monomerid = 84615
TargetAlpha-mannosidase 2(Drosophila melanogaster (Fruit fly))
University Of Toronto
LigandPNGBDBM84615(Mannostatin analogue, 4a)
Affinity DataKi:  300nM. Assay description: The rate of hydrolysis catalyzed by drosophila golgi alpha-mannosidase II (dGMII)and in the presence of different concentration of inhibitor was meas...