BDBM84885 THC, 9-Nor-9-carboxy-delta 9
SMILES CCCCCc1cc(O)c2[C@@H]3C=C(CC[C@H]3C(C)(C)Oc2c1)C(O)=O
InChI Key InChIKey=YOVRGSHRZRJTLZ-HZPDHXFCSA-N
Data  1 KI
  Tab Delimited (TSV)   2D SDfile   Computed 3D by Vconf -m prep SDfile
Find this compound or compounds like it in BindingDB:
Activity Spreadsheet -- Enzyme Inhibition Constant Data from BindingDB
Found 1 hit for monomerid = 84885
TargetCannabinoid receptor 1(Rattus norvegicus (rat))
Virginia Commonwealth University
Curated by PDSP Ki Database
LigandPNGBDBM84885(THC, 9-Nor-9-carboxy-delta 9)
Affinity DataKi: >1.00E+4nM
In DepthDetails PubMed