BDBM86542 Rinvanil, Phenyl-propionyl
SMILES CCCCCC[C@H](CC=CCCCCCCCC(=O)NCc1ccc(O)c(OC)c1)OC(=O)CCc1ccccc1
InChI Key InChIKey=KCJOPRIJNVPRPS-WJOKGBTCSA-N
Data  1 KI
  Tab Delimited (TSV)   2D SDfile   Computed 3D by Vconf -m prep SDfile
Find this compound or compounds like it in BindingDB:
Activity Spreadsheet -- Enzyme Inhibition Constant Data from BindingDB
Found 1 hit for monomerid = 86542
TargetFatty-acid amide hydrolase 1 [30-579](Rattus norvegicus (rat))
University Of Piemonte Orientale
Curated by PDSP Ki Database
LigandPNGBDBM86542(Rinvanil, Phenyl-propionyl)
Affinity DataKi: >1.00E+4nM
In DepthDetails ArticlePubMed