BDBM86917 CAS_44454204::NSC_44454204::methyl-{1-[3-(pyridin-3-yloxy)-propyl]-cyclopropyl}-amine fumarate
SMILES CNC1(CCCOc2cccnc2)CC1
InChI Key InChIKey=RQUMBCGHAHAYKK-UHFFFAOYSA-N
Data  1 KI
  Tab Delimited (TSV)   2D SDfile   Computed 3D by Vconf -m prep SDfile
Find this compound or compounds like it in BindingDB:
Activity Spreadsheet -- Enzyme Inhibition Constant Data from BindingDB
Found 1 hit for monomerid = 86917
TargetNeuronal acetylcholine receptor subunit alpha-4(Rattus norvegicus (Rat))
Servier, Chemistry Research Division A
Curated by PDSP Ki Database
LigandPNGBDBM86917(CAS_44454204 | NSC_44454204 | methyl-{1-[3-(pyridi...)
Affinity DataKi:  2.46E+3nM
In DepthDetails ArticlePubMed