BDBM8718 4-Amino-N-methyl-N-(1-methyl-1H-indol-2-ylmethyl)-benzamide::4-amino-N-methyl-N-[(1-methyl-1H-indol-2-yl)methyl]benzamide::benzamide deriv. 7
SMILES CN(Cc1cc2ccccc2n1C)C(=O)c1ccc(N)cc1
InChI Key InChIKey=ZNIKKTWPMSNEAW-UHFFFAOYSA-N
Data  2 IC50
  Tab Delimited (TSV)   2D SDfile   Computed 3D by Vconf -m prep SDfile
Find this compound or compounds like it in BindingDB:
Activity Spreadsheet -- Enzyme Inhibition Constant Data from BindingDB
Found 2 hits for monomerid = 8718
TargetEnoyl-[acyl-carrier-protein] reductase [NADH] FabI(Haemophilus influenzae)
Glaxosmithkline
LigandPNGBDBM8718(4-Amino-N-methyl-N-(1-methyl-1H-indol-2-ylmethyl)-...)
Affinity DataIC50:  2.60E+3nMT: 2°C. Assay description: Assays were carried out in half-area, 96-well microtiter plates. Compounds were evaluated in assay mixtures containing components specific for each e...
In DepthDetails ArticlePubMed
TargetEnoyl-[acyl-carrier-protein] reductase [NADPH] FabI(Staphylococcus aureus)
Glaxosmithkline
LigandPNGBDBM8718(4-Amino-N-methyl-N-(1-methyl-1H-indol-2-ylmethyl)-...)
Affinity DataIC50:  1.63E+4nMpH: 6.5 T: 2°C. Assay description: Assays were carried out in half-area, 96-well microtiter plates. Compounds were evaluated in assay mixtures containing components specific for each e...
In DepthDetails ArticlePubMed