BDBM8719 N-Methyl-N-(1-methyl-1H-indol-2-ylmethyl)benzamide::N-methyl-N-[(1-methyl-1H-indol-2-yl)methyl]benzamide::benzamide deriv. 8
SMILES CN(Cc1cc2ccccc2n1C)C(=O)c1ccccc1
InChI Key InChIKey=OSHHQNITRNVSKO-UHFFFAOYSA-N
Data  2 IC50
  Tab Delimited (TSV)   2D SDfile   Computed 3D by Vconf -m prep SDfile
Find this compound or compounds like it in BindingDB:
Activity Spreadsheet -- Enzyme Inhibition Constant Data from BindingDB
Found 2 hits for monomerid = 8719
TargetEnoyl-[acyl-carrier-protein] reductase [NADH] FabI(Haemophilus influenzae)
Glaxosmithkline
LigandPNGBDBM8719(N-Methyl-N-(1-methyl-1H-indol-2-ylmethyl)benzamide...)
Affinity DataIC50: >1.00E+5nMT: 2°C. Assay description: Assays were carried out in half-area, 96-well microtiter plates. Compounds were evaluated in assay mixtures containing components specific for each e...
In DepthDetails ArticlePubMed
TargetEnoyl-[acyl-carrier-protein] reductase [NADPH] FabI(Staphylococcus aureus)
Glaxosmithkline
LigandPNGBDBM8719(N-Methyl-N-(1-methyl-1H-indol-2-ylmethyl)benzamide...)
Affinity DataIC50: >1.00E+5nMpH: 6.5 T: 2°C. Assay description: Assays were carried out in half-area, 96-well microtiter plates. Compounds were evaluated in assay mixtures containing components specific for each e...
In DepthDetails ArticlePubMed