BDBM88695 MLS000529691::N-[(2-methyl-1H-indol-5-yl)methyl]-4-(1-piperidinylsulfonyl)benzamide::N-[(2-methyl-1H-indol-5-yl)methyl]-4-piperidin-1-ylsulfonyl-benzamide::N-[(2-methyl-1H-indol-5-yl)methyl]-4-piperidin-1-ylsulfonylbenzamide::N-[(2-methyl-1H-indol-5-yl)methyl]-4-piperidinosulfonyl-benzamide::SMR000127182::cid_4417817
SMILES Cc1cc2cc(CNC(=O)c3ccc(cc3)S(=O)(=O)N3CCCCC3)ccc2[nH]1
InChI Key InChIKey=ROIVZOVMHCMGNV-UHFFFAOYSA-N
Data  3 IC50  2 EC50
  Tab Delimited (TSV)   2D SDfile   Computed 3D by Vconf -m prep SDfile
Find this compound or compounds like it in BindingDB:
Activity Spreadsheet -- Enzyme Inhibition Constant Data from BindingDB
Found 5 hits for monomerid = 88695
TargetMitochondrial import inner membrane translocase subunit TIM23(Saccharomyces cerevisiae S288c)
Burnham Center For Chemical Genomics
Curated by PubChem BioAssay
LigandPNGBDBM88695(MLS000529691 | N-[(2-methyl-1H-indol-5-yl)methyl]-...)
Affinity DataIC50:  7.87E+4nM. Assay description: Data Source: Sanford-Burnham Center for Chemical Genomics (SBCCG) Source Affiliation: Sanford-Burnham Medical Research Institute(SBMRI, San Diego, CA...
In DepthDetails PCBioAssay
TargetMitochondrial import inner membrane translocase subunit TIM10(Saccharomyces cerevisiae S288c)
Burnham Center For Chemical Genomics
Curated by PubChem BioAssay
LigandPNGBDBM88695(MLS000529691 | N-[(2-methyl-1H-indol-5-yl)methyl]-...)
Affinity DataIC50:  7.53E+4nM. Assay description: Data Source: Sanford-Burnham Center for Chemical Genomics (SBCCG) Source Affiliation: Sanford-Burnham Medical Research Institute(SBMRI, San Diego, CA...
In DepthDetails PCBioAssay
TargetBotulinum neurotoxin type A(Clostridium botulinum (strain Hall / ATCC 3502 / N...)
Nmmlsc
Curated by PubChem BioAssay
LigandPNGBDBM88695(MLS000529691 | N-[(2-methyl-1H-indol-5-yl)methyl]-...)
Affinity DataEC50: >2.00E+4nM. Assay description: University of New Mexico Assay Overview: Assay Support: 1 R03 MH093184-01A1 Project Title: High-throughput multiplex microsphere screening for tox...
In DepthDetails PCBioAssay
TargetLethal factor(Bacillus anthracis)
Nmmlsc
Curated by PubChem BioAssay
LigandPNGBDBM88695(MLS000529691 | N-[(2-methyl-1H-indol-5-yl)methyl]-...)
Affinity DataEC50: >2.00E+4nM. Assay description: University of New Mexico Assay Overview: Assay Support: 1 R03 MH093184-01A1 Project Title: High-throughput multiplex microsphere screening for tox...
In DepthDetails PCBioAssay
TargetMitochondrial import inner membrane translocase subunit TIM10(Saccharomyces cerevisiae S288c)
Burnham Center For Chemical Genomics
Curated by PubChem BioAssay
LigandPNGBDBM88695(MLS000529691 | N-[(2-methyl-1H-indol-5-yl)methyl]-...)
Affinity DataIC50:  6.90E+4nM. Assay description: Data Source: Sanford-Burnham Center for Chemical Genomics (SBCCG) Source Affiliation: Sanford-Burnham Medical Research Institute(SBMRI, San Diego, CA...
In DepthDetails PCBioAssay