BDBM89186 4-{2-[({4-nitrobenzoyl}amino)acetyl]carbohydrazonoyl}phenyl benzoate::MLS000325279::SMR000162997::[4-[(Z)-[2-[(4-nitrophenyl)carbonylamino]ethanoylhydrazinylidene]methyl]phenyl] benzoate::[4-[(Z)-[[2-[(4-nitrobenzoyl)amino]acetyl]hydrazinylidene]methyl]phenyl] benzoate::benzoic acid [4-[(Z)-[[2-[(4-nitrobenzoyl)amino]acetyl]hydrazono]methyl]phenyl] ester::benzoic acid [4-[(Z)-[[2-[[(4-nitrophenyl)-oxomethyl]amino]-1-oxoethyl]hydrazinylidene]methyl]phenyl] ester::cid_6016188
SMILES [O-][N+](=O)c1ccc(cc1)C(=O)NCC(=O)N\N=C\c1ccc(OC(=O)c2ccccc2)cc1
InChI Key InChIKey=VNRLZXAZXOYAHS-AFUMVMLFSA-N
Data  1 IC50
  Tab Delimited (TSV)   2D SDfile   Computed 3D by Vconf -m prep SDfile
Find this compound or compounds like it in BindingDB:
Activity Spreadsheet -- Enzyme Inhibition Constant Data from BindingDB
Found 1 hit for monomerid = 89186
TargetDNA (cytosine-5)-methyltransferase 1(Homo sapiens (Human))
Burnham Center For Chemical Genomics
Curated by PubChem BioAssay
LigandPNGBDBM89186(4-{2-[({4-nitrobenzoyl}amino)acetyl]carbohydrazono...)
Affinity DataIC50: >9.90E+4nM. Assay description: Data Source: Sanford-Burnham Center for Chemical Genomics (SBCCG) Source Affiliation: Sanford-Burnham Medical Research Institute (SBMRI, San Diego, C...
Ligand InfoPC cidPC sid
In DepthDetails PCBioAssay