BDBM89265 MLS000580834::N-(3-Chloro-4-methyl-phenyl)-2-oxo-2-{N'-[1-pyridin-4-yl-eth-(E)-ylidene]-hydrazino}-acetamide::N-(3-chloranyl-4-methyl-phenyl)-N'-[(E)-1-pyridin-4-ylethylideneamino]ethanediamide::N-(3-chloro-4-methyl-phenyl)-N'-[(E)-1-(4-pyridyl)ethylideneamino]oxamide::N-(3-chloro-4-methylphenyl)-N'-[(E)-1-pyridin-4-ylethylideneamino]oxamide::SMR000220297::cid_9668287
SMILES CC(=NNC(=O)C(=O)Nc1ccc(C)c(Cl)c1)c1ccncc1
InChI Key InChIKey=XTLZLSQUNGZDGM-UHFFFAOYSA-N
Data  2 IC50
  Tab Delimited (TSV)   2D SDfile   Computed 3D by Vconf -m prep SDfile
Find this compound or compounds like it in BindingDB:
Activity Spreadsheet -- Enzyme Inhibition Constant Data from BindingDB
Found 2 hits for monomerid = 89265
TargetProtein Wnt-3a(Mus musculus)
Burnham Center For Chemical Genomics
Curated by PubChem BioAssay
LigandPNGBDBM89265(MLS000580834 | N-(3-Chloro-4-methyl-phenyl)-2-oxo-...)
Affinity DataIC50:  909nM
In DepthDetails PCBioAssay
TargetZinc finger protein GLI1(Mus musculus)
Burnham Center For Chemical Genomics
Curated by PubChem BioAssay
LigandPNGBDBM89265(MLS000580834 | N-(3-Chloro-4-methyl-phenyl)-2-oxo-...)
Affinity DataIC50:  1.51E+3nM. Assay description: Data Source: Sanford-Burnham Center for Chemical Genomics (SBCCG) Source Affiliation: Sanford-Burnham Medical Research Institute (SBMRI, San Diego, C...
In DepthDetails PCBioAssay