BDBM89693 2,2-difluoro-2-[(2-methyl-1H-indol-3-yl)thio]acetic acid methyl ester::MLS000089932::SMR000024550::cid_595568::methyl 2,2-bis(fluoranyl)-2-[(2-methyl-1H-indol-3-yl)sulfanyl]ethanoate::methyl 2,2-difluoro-2-[(2-methyl-1H-indol-3-yl)sulfanyl]acetate::methyl difluoro[(2-methyl-1H-indol-3-yl)thio]acetate
SMILES COC(=O)C(F)(F)Sc1c(C)[nH]c2ccccc12
InChI Key InChIKey=SXPRPSIWSHFDTE-UHFFFAOYSA-N
Data  1 EC50
  Tab Delimited (TSV)   2D SDfile   Computed 3D by Vconf -m prep SDfile
Find this compound or compounds like it in BindingDB:
Activity Spreadsheet -- Enzyme Inhibition Constant Data from BindingDB
Found 1 hit for monomerid = 89693
TargetCorticotropin-releasing factor-binding protein(Homo sapiens (Human))
Burnham Center For Chemical Genomics
Curated by PubChem BioAssay
LigandPNGBDBM89693(2,2-difluoro-2-[(2-methyl-1H-indol-3-yl)thio]aceti...)
Affinity DataEC50: >5.30E+4nM. Assay description: Data Source: Sanford-Burnham Center for Chemical Genomics (SBCCG) Source Affiliation: Sanford-Burnham Medical Research Institute (SBMRI, San Diego, C...
In DepthDetails PCBioAssay