BDBM89763 MLS000102688::N-[(2-methyl-1,3-thiazol-4-yl)methyl]naphthalene-2-sulfonamide::N-[(2-methyl-4-thiazolyl)methyl]-2-naphthalenesulfonamide::N-[(2-methylthiazol-4-yl)methyl]naphthalene-2-sulfonamide::SMR000018182::cid_5310471
SMILES Cc1nc(CNS(=O)(=O)c2ccc3ccccc3c2)cs1
InChI Key InChIKey=OQWYAQAPTQFBHO-UHFFFAOYSA-N
Data  1 EC50
  Tab Delimited (TSV)   2D SDfile   Computed 3D by Vconf -m prep SDfile
Find this compound or compounds like it in BindingDB:
Activity Spreadsheet -- Enzyme Inhibition Constant Data from BindingDB
Found 1 hit for monomerid = 89763
TargetCorticotropin-releasing factor-binding protein(Homo sapiens (Human))
Burnham Center For Chemical Genomics
Curated by PubChem BioAssay
LigandPNGBDBM89763(MLS000102688 | N-[(2-methyl-1,3-thiazol-4-yl)methy...)
Affinity DataEC50: >5.30E+4nM. Assay description: Data Source: Sanford-Burnham Center for Chemical Genomics (SBCCG) Source Affiliation: Sanford-Burnham Medical Research Institute (SBMRI, San Diego, C...
In DepthDetails PCBioAssay