BDBM90248 3-(dimethylamino)benzoic acid [2-keto-2-[2-(phenylthio)anilino]ethyl] ester::3-(dimethylamino)benzoic acid [2-oxo-2-[2-(phenylthio)anilino]ethyl] ester::MLS000334925::SMR000249683::[2-oxidanylidene-2-[(2-phenylsulfanylphenyl)amino]ethyl] 3-(dimethylamino)benzoate::[2-oxo-2-(2-phenylsulfanylanilino)ethyl] 3-(dimethylamino)benzoate::cid_2079073
SMILES CN(C)c1cccc(c1)C(=O)OCC(=O)Nc1ccccc1Sc1ccccc1
InChI Key InChIKey=VAMMCJXAOIUTKH-UHFFFAOYSA-N
Data  1 IC50  1 EC50
  Tab Delimited (TSV)   2D SDfile   Computed 3D by Vconf -m prep SDfile
Find this compound or compounds like it in BindingDB:
Activity Spreadsheet -- Enzyme Inhibition Constant Data from BindingDB
Found 2 hits for monomerid = 90248
TargetCorticotropin-releasing factor-binding protein(Homo sapiens (Human))
Burnham Center For Chemical Genomics
Curated by PubChem BioAssay
LigandPNGBDBM90248(3-(dimethylamino)benzoic acid [2-keto-2-[2-(phenyl...)
Affinity DataIC50:  2.00E+4nM
In DepthDetails PCBioAssay
TargetCorticotropin-releasing factor-binding protein(Homo sapiens (Human))
Burnham Center For Chemical Genomics
Curated by PubChem BioAssay
LigandPNGBDBM90248(3-(dimethylamino)benzoic acid [2-keto-2-[2-(phenyl...)
Affinity DataEC50: >5.30E+4nM. Assay description: Data Source: Sanford-Burnham Center for Chemical Genomics (SBCCG) Source Affiliation: Sanford-Burnham Medical Research Institute (SBMRI, San Diego, C...
In DepthDetails PCBioAssay