BDBM90400 4-[benzenesulfonyl(butyl)amino]benzoic acid methyl ester::4-[besyl(butyl)amino]benzoic acid methyl ester::MLS000689903::SMR000298591::cid_2217611::methyl 4-[benzenesulfonyl(butyl)amino]benzoate::methyl 4-[butyl(phenylsulfonyl)amino]benzoate
SMILES CCCCN(c1ccc(cc1)C(=O)OC)S(=O)(=O)c1ccccc1
InChI Key InChIKey=GHHQECIJSWMOHK-UHFFFAOYSA-N
Data  1 IC50  1 EC50
  Tab Delimited (TSV)   2D SDfile   Computed 3D by Vconf -m prep SDfile
Find this compound or compounds like it in BindingDB:
Activity Spreadsheet -- Enzyme Inhibition Constant Data from BindingDB
Found 2 hits for monomerid = 90400
TargetCorticotropin-releasing factor-binding protein(Homo sapiens (Human))
Burnham Center For Chemical Genomics
Curated by PubChem BioAssay
LigandPNGBDBM90400(4-[benzenesulfonyl(butyl)amino]benzoic acid methyl...)
Affinity DataIC50:  2.00E+4nM
In DepthDetails PCBioAssay
TargetCorticotropin-releasing factor-binding protein(Homo sapiens (Human))
Burnham Center For Chemical Genomics
Curated by PubChem BioAssay
LigandPNGBDBM90400(4-[benzenesulfonyl(butyl)amino]benzoic acid methyl...)
Affinity DataEC50: >5.30E+4nM. Assay description: Data Source: Sanford-Burnham Center for Chemical Genomics (SBCCG) Source Affiliation: Sanford-Burnham Medical Research Institute (SBMRI, San Diego, C...
In DepthDetails PCBioAssay