BDBM91390 MLS002694705::N-methyl-N-[(4-nitrophenyl)methyl]aniline::SMR001560628::cid_258032::methyl-(4-nitrobenzyl)-phenyl-amine
SMILES CN(Cc1ccc(cc1)[N+]([O-])=O)c1ccccc1
InChI Key InChIKey=DVCSMFBQEXZMES-UHFFFAOYSA-N
Data  1 IC50  1 EC50
  Tab Delimited (TSV)   2D SDfile   Computed 3D by Vconf -m prep SDfile
Find this compound or compounds like it in BindingDB:
Activity Spreadsheet -- Enzyme Inhibition Constant Data from BindingDB
Found 2 hits for monomerid = 91390
TargetCorticotropin-releasing factor-binding protein(Homo sapiens (Human))
Burnham Center For Chemical Genomics
Curated by PubChem BioAssay
LigandPNGBDBM91390(MLS002694705 | N-methyl-N-[(4-nitrophenyl)methyl]a...)
Affinity DataIC50:  7.06E+3nM
Ligand InfoPC cidPC sid
In DepthDetails PCBioAssay
TargetCorticotropin-releasing factor-binding protein(Homo sapiens (Human))
Burnham Center For Chemical Genomics
Curated by PubChem BioAssay
LigandPNGBDBM91390(MLS002694705 | N-methyl-N-[(4-nitrophenyl)methyl]a...)
Affinity DataEC50: >5.30E+4nM. Assay description: Data Source: Sanford-Burnham Center for Chemical Genomics (SBCCG) Source Affiliation: Sanford-Burnham Medical Research Institute (SBMRI, San Diego, C...
Ligand InfoPC cidPC sid
In DepthDetails PCBioAssay