BDBM92824 Bisanilinopyrimidine, 6q::US9249124, 40
SMILES OC(=O)c1ccc(Nc2nccc(Nc3ccccc3-c3ccccc3)n2)cc1
InChI Key InChIKey=RSUKUXYTJJCQKG-UHFFFAOYSA-N
Data  4 IC50  1 Kd
PDB links: 1 PDB ID matches this monomer.
  Tab Delimited (TSV)   2D SDfile   Computed 3D by Vconf -m prep SDfile
Find this compound or compounds like it in BindingDB:
Activity Spreadsheet -- Enzyme Inhibition Constant Data from BindingDB
Found 4 hits for monomerid = 92824
TargetAurora kinase A(Homo sapiens (Human))
Moffitt Cancer Center
LigandPNGBDBM92824(Bisanilinopyrimidine, 6q | US9249124, 40)
Affinity DataIC50:  149nM. Assay description: In vitro enzyme activity assay using Aurora Kinase A.
TargetAurora kinase A(Homo sapiens (Human))
Moffitt Cancer Center
LigandPNGBDBM92824(Bisanilinopyrimidine, 6q | US9249124, 40)
Affinity DataIC50:  149nM Kd:  299nMpH: 7.4Assay Description:The binding of inhibitors to Aurora A kinase was analyzed with a MicroCal iTC200 titration calorimeter (GE Healthcare, Piscataway, N.J.). The protein...
TargetAurora kinase A(Homo sapiens (Human))
Moffitt Cancer Center
LigandPNGBDBM92824(Bisanilinopyrimidine, 6q | US9249124, 40)
Affinity DataIC50:  149nMpH: 7.4 T: 2°C. Assay description: Aurora A was exchanged into 50 mM phosphate buffer (pH 7.4) including 1 mM DTT via PD-10 columns and was concentrated to 20 mg mL-1 using Amicon Ultr...
TargetAurora kinase A(Homo sapiens (Human))
Moffitt Cancer Center
LigandPNGBDBM92824(Bisanilinopyrimidine, 6q | US9249124, 40)
Affinity DataIC50:  149nMpH: 7.4 T: 2°C. Assay description: Reactions were carried out at room temperature in 15 mM HEPES buffer (pH 7.4) containing 20 mM NaCl, 1 mM EGTA, 0.02% Tween 20, 10 mM MgCl2, 5% (v/v)...