BDBM93067 Vitamin D analog, 13::Vitamin D analog, 17
SMILES CCCC[C@H](C)C1CCC2\C(CCC[C@]12C)=C\C=C1C[C@@H](O)C(C)[C@H](O)C1
InChI Key InChIKey=MGADROAPTBMHLU-FHDXVZLNSA-N
Data  2 KI
  Tab Delimited (TSV)   2D SDfile   Computed 3D by Vconf -m prep SDfile
Find this compound or compounds like it in BindingDB:
Activity Spreadsheet -- Enzyme Inhibition Constant Data from BindingDB
Found 2 hits for monomerid = 93067
TargetVitamin D3 receptor(Homo sapiens (Human))
University Of Wisconsin-Madison
LigandPNGBDBM93067(Vitamin D analog, 13 | Vitamin D analog, 17)
Affinity DataKi:  0.200nM. Assay description: In vitro study, VDR binding assay were performed as previously described.
In DepthDetails ArticlePubMed
TargetVitamin D3 receptor(Homo sapiens (Human))
University Of Wisconsin-Madison
LigandPNGBDBM93067(Vitamin D analog, 13 | Vitamin D analog, 17)
Affinity DataKi:  100nM. Assay description: In vitro study, VDR binding assay were performed as previously described.
In DepthDetails ArticlePubMed