BDBM93065 Vitamin D analog, 10::Vitamin D analog, 14
SMILES C[C@H](CCCCO)C1CCC2\C(CCC[C@]12C)=C\C=C1C[C@@H](O)C(C)[C@H](O)C1
InChI Key InChIKey=YZIQNNXLWCGZKG-VMVGZSKMSA-N
Data  2 KI
  Tab Delimited (TSV)   2D SDfile   Computed 3D by Vconf -m prep SDfile
Find this compound or compounds like it in BindingDB:
Activity Spreadsheet -- Enzyme Inhibition Constant Data from BindingDB
Found 2 hits for monomerid = 93065
TargetVitamin D3 receptor(Homo sapiens (Human))
University Of Wisconsin-Madison
LigandPNGBDBM93065(Vitamin D analog, 10 | Vitamin D analog, 14)
Affinity DataKi:  1nM. Assay description: In vitro study, VDR binding assay were performed as previously described.
In DepthDetails ArticlePubMed
TargetVitamin D3 receptor(Homo sapiens (Human))
University Of Wisconsin-Madison
LigandPNGBDBM93065(Vitamin D analog, 10 | Vitamin D analog, 14)
Affinity DataKi:  50nM. Assay description: In vitro study, VDR binding assay were performed as previously described.
In DepthDetails ArticlePubMed