BDBM93270 Tetramic acid, 44
SMILES CCC(C)C1NC(=O)C(SCC(=O)NCc2ccc3OCOc3c2)C1=O
InChI Key InChIKey=UOKYUMQCJCVNKC-UHFFFAOYSA-N
Data  1 IC50
  Tab Delimited (TSV)   2D SDfile   Computed 3D by Vconf -m prep SDfile
Find this compound or compounds like it in BindingDB:
Activity Spreadsheet -- Enzyme Inhibition Constant Data from BindingDB
Found 1 hit for monomerid = 93270
TargetBeta-secretase 1(Homo sapiens (Human))
Darmstadt Technical University
LigandPNGBDBM93270(Tetramic acid, 44)
Affinity DataIC50: >2.00E+5nMT: 2°C. Assay description: The FRET assay was performed at 20 C on a FLUOstar (BMG Lab Technologies, D-77656 Offenburg) using 96-well microtiter plates (Dynex Microfluor 2, Cha...
In DepthDetails ArticlePubMed