BDBM93615 4-[(3-keto-5-methyl-3-pyrazolin-4-yl)-(1-methylindol-3-yl)methyl]-5-methyl-3-pyrazolin-3-one::5-methyl-4-[(1-methyl-3-indolyl)-(3-methyl-5-oxo-1,2-dihydropyrazol-4-yl)methyl]-1,2-dihydropyrazol-3-one::5-methyl-4-[(1-methylindol-3-yl)-(3-methyl-5-oxidanylidene-1,2-dihydropyrazol-4-yl)methyl]-1,2-dihydropyrazol-3-one::5-methyl-4-[(1-methylindol-3-yl)-(3-methyl-5-oxo-1,2-dihydropyrazol-4-yl)methyl]-1,2-dihydropyrazol-3-one::MLS000715645::SMR000277162::cid_3154434
SMILES Cc1[nH][nH]c(=O)c1C(c1cn(C)c2ccccc12)c1c(C)[nH][nH]c1=O
InChI Key InChIKey=WGSFXOCBUPKNFE-UHFFFAOYSA-N
Data  2 IC50
  Tab Delimited (TSV)   2D SDfile   Computed 3D by Vconf -m prep SDfile
Find this compound or compounds like it in BindingDB:
Activity Spreadsheet -- Enzyme Inhibition Constant Data from BindingDB
Found 2 hits for monomerid = 93615
TargetSentrin-specific protease 8(Homo sapiens (Human))
Burnham Center For Chemical Genomics
Curated by PubChem BioAssay
LigandPNGBDBM93615(4-[(3-keto-5-methyl-3-pyrazolin-4-yl)-(1-methylind...)
Affinity DataIC50:  1.12E+4nM
In DepthDetails PCBioAssay
TargetSentrin-specific protease 8(Homo sapiens (Human))
Burnham Center For Chemical Genomics
Curated by PubChem BioAssay
LigandPNGBDBM93615(4-[(3-keto-5-methyl-3-pyrazolin-4-yl)-(1-methylind...)
Affinity DataIC50:  1.12E+4nM
In DepthDetails PCBioAssay