BDBM93785 2-Benzyloxy-3-methyl-quinoxaline::2-benzoxy-3-methyl-quinoxaline::2-methyl-3-phenylmethoxy-quinoxaline::2-methyl-3-phenylmethoxyquinoxaline::MLS000589397::SMR000212755::cid_910952
SMILES Cc1nc2ccccc2nc1OCc1ccccc1
InChI Key InChIKey=RWYUCXXYVBFMEJ-UHFFFAOYSA-N
Data  1 IC50
  Tab Delimited (TSV)   2D SDfile   Computed 3D by Vconf -m prep SDfile
Find this compound or compounds like it in BindingDB:
Activity Spreadsheet -- Enzyme Inhibition Constant Data from BindingDB
Found 1 hit for monomerid = 93785
TargetProtein skinhead-1(Caenorhabditis elegans)
Burnham Center For Chemical Genomics
Curated by PubChem BioAssay
LigandPNGBDBM93785(2-Benzyloxy-3-methyl-quinoxaline | 2-benzoxy-3-met...)
Affinity DataIC50:  6.81E+4nM
Ligand InfoPC cidPC sid
In DepthDetails PCBioAssay