BDBM94176 1-[benzoyl(tert-butyl)amino]-3-(4-chlorophenyl)urea::1-[tert-butyl(phenylcarbonyl)amino]-3-(4-chlorophenyl)urea::2-benzoyl-2-tert-butyl-N-(4-chlorophenyl)hydrazinecarboxamide::MLS000546113::SMR000161267::cid_848609
SMILES CC(C)(C)N(NC(=O)Nc1ccc(Cl)cc1)C(=O)c1ccccc1
InChI Key InChIKey=NDADXRZIOKLIGI-UHFFFAOYSA-N
Data  1 IC50
  Tab Delimited (TSV)   2D SDfile   Computed 3D by Vconf -m prep SDfile
Find this compound or compounds like it in BindingDB:
Activity Spreadsheet -- Enzyme Inhibition Constant Data from BindingDB
Found 1 hit for monomerid = 94176
TargetNeuropilin-1(Homo sapiens (Human))
Burnham Center For Chemical Genomics
Curated by PubChem BioAssay
LigandPNGBDBM94176(1-[benzoyl(tert-butyl)amino]-3-(4-chlorophenyl)ure...)
Affinity DataIC50: >9.50E+4nM
Ligand InfoPC cidPC sid
In DepthDetails PCBioAssay