BDBM94328 2-benzamidoethyl benzoate::MLS001360415::SMR001224023::benzoic acid 2-benzamidoethyl ester::cid_5131781
SMILES O=C(NCCOC(=O)c1ccccc1)c1ccccc1
InChI Key InChIKey=HMEZXVFFZHPCDN-UHFFFAOYSA-N
Data  1 IC50
  Tab Delimited (TSV)   2D SDfile   Computed 3D by Vconf -m prep SDfile
Find this compound or compounds like it in BindingDB:
Activity Spreadsheet -- Enzyme Inhibition Constant Data from BindingDB
Found 1 hit for monomerid = 94328
TargetNeuropilin-1(Homo sapiens (Human))
Burnham Center For Chemical Genomics
Curated by PubChem BioAssay
LigandPNGBDBM94328(2-benzamidoethyl benzoate | MLS001360415 | SMR0012...)
Affinity DataIC50: >9.50E+4nM
In DepthDetails PCBioAssay