BDBM94567 MLS001333570::SMR000875281::Tiamulin fumarate::cid_9938794
SMILES OC(=O)\C=C\C(O)=O.[H][C@@]12C(=O)CC[C@]11CCC(C)[C@@]2(C)[C@@H](C[C@@](C)(C=C)[C@@H](O)[C@@H]1C)OC(=O)CSCCN(CC)CC
InChI Key InChIKey=YXQXDXAHCSEVSD-IHAONTCTSA-N
Data  3 IC50
  Tab Delimited (TSV)   2D SDfile   Computed 3D by Vconf -m prep SDfile
Find this compound or compounds like it in BindingDB:
Activity Spreadsheet -- Enzyme Inhibition Constant Data from BindingDB
Found 3 hits for monomerid = 94567
TargetHepatocyte nuclear factor 4-alpha(Homo sapiens (Human))
The Scripps Research Institute Molecular Screening Center
Curated by PubChem BioAssay
LigandPNGBDBM94567(MLS001333570 | SMR000875281 | Tiamulin fumarate | ...)
Affinity DataIC50: >3.98E+4nM
In DepthDetails PCBioAssay
TargetPerilipin-5(Homo sapiens (Human))
The Scripps Research Institute Molecular Screening Center
Curated by PubChem BioAssay
LigandPNGBDBM94567(MLS001333570 | SMR000875281 | Tiamulin fumarate | ...)
Affinity DataIC50:  8.04E+3nM
In DepthDetails PCBioAssay
TargetPerilipin-1(Homo sapiens (Human))
The Scripps Research Institute Molecular Screening Center
Curated by PubChem BioAssay
LigandPNGBDBM94567(MLS001333570 | SMR000875281 | Tiamulin fumarate | ...)
Affinity DataIC50:  1.13E+4nM
In DepthDetails PCBioAssay