BDBM95510 2-[(4-bromo-1-ethyl-pyrazole-3-carbonyl)amino]benzoic acid methyl ester::2-[[(4-bromo-1-ethyl-3-pyrazolyl)-oxomethyl]amino]benzoic acid methyl ester::MLS000663440::SMR000292594::cid_994072::methyl 2-[(4-bromanyl-1-ethyl-pyrazol-3-yl)carbonylamino]benzoate::methyl 2-[(4-bromo-1-ethylpyrazole-3-carbonyl)amino]benzoate::methyl 2-{[(4-bromo-1-ethyl-1H-pyrazol-3-yl)carbonyl]amino}benzoate
SMILES CCn1cc(Br)c(n1)C(=O)Nc1ccccc1C(=O)OC
InChI Key InChIKey=KLDTVFPVUSOHRN-UHFFFAOYSA-N
Data  1 IC50
  Tab Delimited (TSV)   2D SDfile   Computed 3D by Vconf -m prep SDfile
Find this compound or compounds like it in BindingDB:
Activity Spreadsheet -- Enzyme Inhibition Constant Data from BindingDB
Found 1 hit for monomerid = 95510
TargetNuclear receptor subfamily 5 group A member 2(Homo sapiens (Human))
The Scripps Research Institute Molecular Screening Center
Curated by PubChem BioAssay
LigandPNGBDBM95510(2-[(4-bromo-1-ethyl-pyrazole-3-carbonyl)amino]benz...)
Affinity DataIC50: >3.59E+4nM
In DepthDetails PCBioAssay