BDBM95814 5-[(2-chloranyl-4-methoxy-phenoxy)methyl]-N-[(4-methyl-1,3-thiazol-2-yl)methyl]-1,2-oxazole-3-carboxamide::5-[(2-chloro-4-methoxy-phenoxy)methyl]-N-[(4-methylthiazol-2-yl)methyl]isoxazole-3-carboxamide::5-[(2-chloro-4-methoxyphenoxy)methyl]-N-[(4-methyl-1,3-thiazol-2-yl)methyl]-1,2-oxazole-3-carboxamide::5-[(2-chloro-4-methoxyphenoxy)methyl]-N-[(4-methyl-2-thiazolyl)methyl]-3-isoxazolecarboxamide::MLS001083358::SMR000665334::cid_24790688
SMILES COc1ccc(OCc2cc(no2)C(=O)NCc2nc(C)cs2)c(Cl)c1
InChI Key InChIKey=ZIAWVAJVWSNWHS-UHFFFAOYSA-N
Data  1 IC50
  Tab Delimited (TSV)   2D SDfile   Computed 3D by Vconf -m prep SDfile
Find this compound or compounds like it in BindingDB:
Activity Spreadsheet -- Enzyme Inhibition Constant Data from BindingDB
Found 1 hit for monomerid = 95814
TargetMethionine--tRNA ligase(Trypanosoma brucei brucei strain 927/4 GUTat10.1)
The Scripps Research Institute Molecular Screening Center
Curated by PubChem BioAssay
LigandPNGBDBM95814(5-[(2-chloranyl-4-methoxy-phenoxy)methyl]-N-[(4-me...)
Affinity DataIC50:  2.35E+4nM
In DepthDetails PCBioAssay