BDBM96433 ({[5-Bromo-2-(toluene-4-sulfonylamino)-phenyl]-phenyl-methyl}-amino)-acetic acid::2-[[[5-bromanyl-2-[(4-methylphenyl)sulfonylamino]phenyl]-phenyl-methyl]amino]ethanoic acid::2-[[[5-bromo-2-(tosylamino)phenyl]-phenyl-methyl]amino]acetic acid::2-[[[5-bromo-2-[(4-methylphenyl)sulfonylamino]phenyl]-phenylmethyl]amino]acetic acid::MLS000553555::SMR000171477::cid_2862125
SMILES Cc1ccc(cc1)S(=O)(=O)Nc1ccc(Br)cc1C(NCC(O)=O)c1ccccc1
InChI Key InChIKey=ZICHOBXDQPYPPG-UHFFFAOYSA-N
Data  1 IC50
  Tab Delimited (TSV)   2D SDfile   Computed 3D by Vconf -m prep SDfile
Find this compound or compounds like it in BindingDB:
Activity Spreadsheet -- Enzyme Inhibition Constant Data from BindingDB
Found 1 hit for monomerid = 96433
TargetHuntingtin(Homo sapiens (Human))
The Scripps Research Institute Molecular Screening Center
Curated by PubChem BioAssay
LigandPNGBDBM96433(({[5-Bromo-2-(toluene-4-sulfonylamino)-phenyl]-phe...)
Affinity DataIC50:  2.90E+3nM
In DepthDetails PCBioAssay