BDBM96454 4-[((4-chlorobenzyl){[(3-chloro-4-methylphenyl)amino]carbonothioyl}amino)methyl]benzoic acid::4-[[(3-chloranyl-4-methyl-phenyl)carbamothioyl-[(4-chlorophenyl)methyl]amino]methyl]benzoic acid::4-[[(3-chloro-4-methylphenyl)carbamothioyl-[(4-chlorophenyl)methyl]amino]methyl]benzoic acid::4-[[(4-chlorobenzyl)-[(3-chloro-4-methyl-phenyl)thiocarbamoyl]amino]methyl]benzoic acid::4-[[[(3-chloro-4-methylanilino)-sulfanylidenemethyl]-[(4-chlorophenyl)methyl]amino]methyl]benzoic acid::MLS000673572::SMR000314813::cid_4070237
SMILES Cc1ccc(NC(=S)N(Cc2ccc(Cl)cc2)Cc2ccc(cc2)C(O)=O)cc1Cl
InChI Key InChIKey=HCUHEIDMWDTNRV-UHFFFAOYSA-N
Data  1 IC50
  Tab Delimited (TSV)   2D SDfile   Computed 3D by Vconf -m prep SDfile
Find this compound or compounds like it in BindingDB:
Activity Spreadsheet -- Enzyme Inhibition Constant Data from BindingDB
Found 1 hit for monomerid = 96454
TargetHuntingtin(Homo sapiens (Human))
The Scripps Research Institute Molecular Screening Center
Curated by PubChem BioAssay
LigandPNGBDBM96454(4-[((4-chlorobenzyl){[(3-chloro-4-methylphenyl)ami...)
Affinity DataIC50:  3.89E+3nM
In DepthDetails PCBioAssay