BDBM96724 2-(9-phenanthrenyl)guanidine::2-(9-phenanthryl)guanidine::2-phenanthren-9-ylguanidine::Guanidine, 1-(9-phenanthryl)-::MLS000757169::SMR000529028::cid_344197
SMILES [#7]\[#6](-[#7])=[#7]\c1cc2ccccc2c2ccccc12
InChI Key InChIKey=OTMNKUFLYIQWDV-UHFFFAOYSA-N
Data  2 IC50  2 EC50
  Tab Delimited (TSV)   2D SDfile   Computed 3D by Vconf -m prep SDfile
Find this compound or compounds like it in BindingDB:
Activity Spreadsheet -- Enzyme Inhibition Constant Data from BindingDB
Found 4 hits for monomerid = 96724
TargetGuanine nucleotide-binding protein subunit alpha-15(Homo sapiens (Human))
The Scripps Research Institute Molecular Screening Center
Curated by PubChem BioAssay
LigandPNGBDBM96724(2-(9-phenanthrenyl)guanidine | 2-(9-phenanthryl)gu...)
Affinity DataEC50: >2.99E+4nM
In DepthDetails PCBioAssay
TargetGuanine nucleotide-binding protein subunit alpha-15(Homo sapiens (Human))
The Scripps Research Institute Molecular Screening Center
Curated by PubChem BioAssay
LigandPNGBDBM96724(2-(9-phenanthrenyl)guanidine | 2-(9-phenanthryl)gu...)
Affinity DataIC50: >2.99E+4nM
In DepthDetails PCBioAssay
TargetTrace amine-associated receptor 1(Homo sapiens (Human))
The Scripps Research Institute Molecular Screening Center
Curated by PubChem BioAssay
LigandPNGBDBM96724(2-(9-phenanthrenyl)guanidine | 2-(9-phenanthryl)gu...)
Affinity DataEC50:  657nM
In DepthDetails PCBioAssay
TargetTrace amine-associated receptor 1(Homo sapiens (Human))
The Scripps Research Institute Molecular Screening Center
Curated by PubChem BioAssay
LigandPNGBDBM96724(2-(9-phenanthrenyl)guanidine | 2-(9-phenanthryl)gu...)
Affinity DataIC50:  933nM
In DepthDetails PCBioAssay