BDBM97181 4-methyl-4-(phenylsulfanylmethyl)azetidin-2-one::4-methyl-4-[(phenylthio)methyl]-2-azetidinone::4-methyl-4-[(phenylthio)methyl]azetidin-2-one::MLS003115736::SMR001831307::cid_326887
SMILES CC1(CSc2ccccc2)CC(=O)N1
InChI Key InChIKey=HWNBODVECSTPNY-UHFFFAOYSA-N
Data  1 IC50
  Tab Delimited (TSV)   2D SDfile   Computed 3D by Vconf -m prep SDfile
Find this compound or compounds like it in BindingDB:
Activity Spreadsheet -- Enzyme Inhibition Constant Data from BindingDB
Found 1 hit for monomerid = 97181
TargetGalanin receptor type 3(Homo sapiens (Human))
The Scripps Research Institute Molecular Screening Center
Curated by PubChem BioAssay
LigandPNGBDBM97181(4-methyl-4-(phenylsulfanylmethyl)azetidin-2-one | ...)
Affinity DataIC50: >2.99E+4nM
Ligand InfoPC cidPC sid
In DepthDetails PCBioAssay